make[3]: Entering directory '/build/lede-17.01-phase2/mips64_mips64/build/sdk/feeds/packages/lang/perl-www-curl'
PERL5LIB=  make -C /build/lede-17.01-phase2/mips64_mips64/build/sdk/build_dir/target-mips64_mips64_64_musl-1.1.15/perl/WWW-Curl-4.17  install
make[4]: Entering directory '/build/lede-17.01-phase2/mips64_mips64/build/sdk/build_dir/target-mips64_mips64_64_musl-1.1.15/perl/WWW-Curl-4.17'
mips64-openwrt-linux-gcc -c  -I/build/lede-17.01-phase2/mips64_mips64/build/sdk/staging_dir/target-mips64_mips64_64_musl-1.1.15/usr/include -D_LARGEFILE_SOURCE -D_FILE_OFFSET_BITS=64 -Os -pipe -mno-branch-likely -mips64 -mtune=mips64 -mabi=64 -fno-caller-saves -fno-plt -fhonour-copts -Wno-error=unused-but-set-variable -Wno-error=unused-result -msoft-float -iremap /build/lede-17.01-phase2/mips64_mips64/build/sdk/build_dir/target-mips64_mips64_64_musl-1.1.15/perl/WWW-Curl-4.17:WWW-Curl-4.17 -Wformat -Werror=format-security -fstack-protector -D_FORTIFY_SOURCE=1 -Wl,-z,now -Wl,-z,relro -I/build/lede-17.01-phase2/mips64_mips64/build/sdk/staging_dir/target-mips64_mips64_64_musl-1.1.15/usr/include -I/build/lede-17.01-phase2/mips64_mips64/build/sdk/staging_dir/target-mips64_mips64_64_musl-1.1.15/include -I/build/lede-17.01-phase2/mips64_mips64/build/sdk/staging_dir/toolchain-mips64_mips64_64_gcc-5.4.0_musl-1.1.15/usr/include -I/build/lede-17.01-phase2/mips64_mips64/build/sdk/staging_dir/toolchain-mips64_mips64_64_gcc-5.4.0_musl-1.1.15/include/fortify -I/build/lede-17.01-phase2/mips64_mips64/build/sdk/staging_dir/toolchain-mips64_mips64_64_gcc-5.4.0_musl-1.1.15/include -O2   -DVERSION=\"4.17\" -DXS_VERSION=\"4.17\" -fPIC "-I/build/lede-17.01-phase2/mips64_mips64/build/sdk/staging_dir/target-mips64_mips64_64_musl-1.1.15/usr/lib/perl5/5.22/CORE/"   Curl.c
In file included from Curl.xs:574:0:
curlopt-constants.c: In function 'constant':
curlopt-constants.c:19:58: warning: 'return' with no value, in function returning non-void
             if (strEQ(name, "DID_MEMORY_FUNC_TYPEDEFS")) return CURL_DID_MEMORY_FUNC_TYPEDEFS;
                                                          ^
curlopt-constants.c:129:49: error: 'CURL_STRICTER' undeclared (first use in this function)
             if (strEQ(name, "STRICTER")) return CURL_STRICTER;
                                                 ^
curlopt-constants.c:129:49: note: each undeclared identifier is reported only once for each function it appears in
curlopt-constants.c:2075:44: warning: overflow in implicit constant conversion [-Woverflow]
             if (strEQ(name, "ANY")) return CURLAUTH_ANY;
                                            ^
curlopt-constants.c:2076:48: warning: overflow in implicit constant conversion [-Woverflow]
             if (strEQ(name, "ANYSAFE")) return CURLAUTH_ANYSAFE;
                                                ^
Makefile:353: recipe for target 'Curl.o' failed
make[4]: *** [Curl.o] Error 1
make[4]: Leaving directory '/build/lede-17.01-phase2/mips64_mips64/build/sdk/build_dir/target-mips64_mips64_64_musl-1.1.15/perl/WWW-Curl-4.17'
Makefile:49: recipe for target '/build/lede-17.01-phase2/mips64_mips64/build/sdk/build_dir/target-mips64_mips64_64_musl-1.1.15/perl/WWW-Curl-4.17/.built' failed
make[3]: *** [/build/lede-17.01-phase2/mips64_mips64/build/sdk/build_dir/target-mips64_mips64_64_musl-1.1.15/perl/WWW-Curl-4.17/.built] Error 2
make[3]: Leaving directory '/build/lede-17.01-phase2/mips64_mips64/build/sdk/feeds/packages/lang/perl-www-curl'