OF: fdt: Ignoring memory range 0x80000000 - 0x80200000
Linux version 4.15.0-rc9-00064-gf923ce3a29af (rjones@trick.home.annexia.org) (gcc version 7.3.1 20180129 (GCC)) #1 SMP Thu Feb 15 10:59:13 GMT 2018
bootconsole [early0] enabled
Initial ramdisk at: 0x        (ptrval) (512 bytes)
Zone ranges:
  DMA32    empty
  Normal   [mem 0x0000000080200000-0x000000017fffffff]
Movable zone start for each node
Early memory node ranges
  node   0: [mem 0x0000000080200000-0x000000017fffffff]
Initmem setup node 0 [mem 0x0000000080200000-0x000000017fffffff]
elf_hwcap is 0x112d
percpu: Embedded 15 pages/cpu @        (ptrval) s29592 r0 d31848 u61440
Built 1 zonelists, mobility grouping on.  Total pages: 1033735
Kernel command line: console=ttyS0 ro root=/dev/vda init=/init
Dentry cache hash table entries: 524288 (order: 10, 4194304 bytes)
Inode-cache hash table entries: 262144 (order: 9, 2097152 bytes)
Sorting __ex_table...
Memory: 4119768K/4192256K available (5849K kernel code, 340K rwdata, 1541K rodata, 200K init, 847K bss, 72488K reserved, 0K cma-reserved)
SLUB: HWalign=64, Order=0-3, MinObjects=0, CPUs=2, Nodes=1
Hierarchical RCU implementation.
	RCU restricting CPUs from NR_CPUS=8 to nr_cpu_ids=2.
RCU: Adjusting geometry for rcu_fanout_leaf=16, nr_cpu_ids=2
NR_IRQS: 0, nr_irqs: 0, preallocated irqs: 0
riscv,cpu_intc,0: 64 local interrupts mapped
riscv,cpu_intc,1: 64 local interrupts mapped
------------[ cut here ]------------
WARNING: CPU: 0 PID: 0 at drivers/irqchip/irq-riscv-intc.c:159 riscv_irq_enable+0x92/0x94
CPU: 0 PID: 0 Comm: swapper/0 Not tainted 4.15.0-rc9-00064-gf923ce3a29af #1
Call Trace:
[<        (ptrval)>] walk_stackframe+0x0/0xa2
[<        (ptrval)>] show_stack+0x26/0x34
[<        (ptrval)>] dump_stack+0x5e/0x7c
[<        (ptrval)>] __warn+0xc6/0xdc
[<        (ptrval)>] warn_slowpath_null+0x2c/0x3e
[<        (ptrval)>] riscv_irq_enable+0x8e/0x94
[<        (ptrval)>] irq_enable+0x3a/0x6a
[<        (ptrval)>] __irq_startup+0x80/0x88
[<        (ptrval)>] irq_startup+0x4e/0xe2
[<        (ptrval)>] irq_activate_and_startup+0x1c/0x28
[<        (ptrval)>] __irq_do_set_handler+0x6e/0x134
[<        (ptrval)>] irq_set_chained_handler_and_data+0x2c/0x4a
[<        (ptrval)>] plic_init+0x216/0x34a
[<        (ptrval)>] of_irq_init+0x132/0x232
[<        (ptrval)>] irqchip_init+0x10/0x1c
[<        (ptrval)>] init_IRQ+0x8/0x14
[<        (ptrval)>] start_kernel+0x1f6/0x32c
[<        (ptrval)>] _sinittext+0x4e/0x56
random: get_random_bytes called from print_oops_end_marker+0x3a/0x52 with crng_init=0
---[ end trace 3f245499100bcdd5 ]---
riscv,plic0,c000000: mapped 10 interrupts to 2/4 handlers
clocksource: riscv_clocksource: mask: 0xffffffffffffffff max_cycles: 0x24e6a1710, max_idle_ns: 440795202120 ns
Console: colour dummy device 80x25
Calibrating delay loop (skipped), value calculated using timer frequency.. 20.00 BogoMIPS (lpj=40000)
pid_max: default: 32768 minimum: 301
Mount-cache hash table entries: 8192 (order: 4, 65536 bytes)
Mountpoint-cache hash table entries: 8192 (order: 4, 65536 bytes)
Hierarchical SRCU implementation.
smp: Bringing up secondary CPUs ...
clocksource: riscv_clocksource: mask: 0xffffffffffffffff max_cycles: 0x24e6a1710, max_idle_ns: 440795202120 ns
smp: Brought up 1 node, 2 CPUs
devtmpfs: initialized
clocksource: jiffies: mask: 0xffffffff max_cycles: 0xffffffff, max_idle_ns: 7645041785100000 ns
futex hash table entries: 512 (order: 3, 32768 bytes)
NET: Registered protocol family 16
vgaarb: loaded
SCSI subsystem initialized
usbcore: registered new interface driver usbfs
usbcore: registered new interface driver hub
usbcore: registered new device driver usb
clocksource: Switched to clocksource riscv_clocksource
NET: Registered protocol family 2
TCP established hash table entries: 32768 (order: 6, 262144 bytes)
TCP bind hash table entries: 32768 (order: 7, 524288 bytes)
TCP: Hash tables configured (established 32768 bind 32768)
UDP hash table entries: 2048 (order: 4, 65536 bytes)
UDP-Lite hash table entries: 2048 (order: 4, 65536 bytes)
NET: Registered protocol family 1
RPC: Registered named UNIX socket transport module.
RPC: Registered udp transport module.
RPC: Registered tcp transport module.
RPC: Registered tcp NFSv4.1 backchannel transport module.
Unpacking initramfs...
Initialise system trusted keyrings
workingset: timestamp_bits=62 max_order=20 bucket_order=0
NFS: Registering the id_resolver key type
Key type id_resolver registered
Key type id_legacy registered
nfs4filelayout_init: NFSv4 File Layout Driver Registering...
nfs4flexfilelayout_init: NFSv4 Flexfile Layout Driver Registering...
SGI XFS with ACLs, security attributes, no debug enabled
random: fast init done
NET: Registered protocol family 38
Key type asymmetric registered
Asymmetric key parser 'x509' registered
Block layer SCSI generic (bsg) driver version 0.4 loaded (major 254)
io scheduler noop registered
io scheduler deadline registered
io scheduler cfq registered (default)
io scheduler mq-deadline registered
io scheduler kyber registered
Serial: 8250/16550 driver, 4 ports, IRQ sharing disabled
console [ttyS0] disabled
10000000.uart: ttyS0 at MMIO 0x10000000 (irq = 11, base_baud = 230400) is a 16550A
OF: fdt: Ignoring memory range 0x80000000 - 0x80200000
Linux version 4.15.0-rc9-00064-gf923ce3a29af (rjones@trick.home.annexia.org) (gcc version 7.3.1 20180129 (GCC)) #1 SMP Thu Feb 15 10:59:13 GMT 2018
bootconsole [early0] enabled
Initial ramdisk at: 0x        (ptrval) (512 bytes)
Zone ranges:
  DMA32    empty
  Normal   [mem 0x0000000080200000-0x000000017fffffff]
Movable zone start for each node
Early memory node ranges
  node   0: [mem 0x0000000080200000-0x000000017fffffff]
Initmem setup node 0 [mem 0x0000000080200000-0x000000017fffffff]
elf_hwcap is 0x112d
percpu: Embedded 15 pages/cpu @        (ptrval) s29592 r0 d31848 u61440
Built 1 zonelists, mobility grouping on.  Total pages: 1033735
Kernel command line: console=ttyS0 ro root=/dev/vda init=/init
Dentry cache hash table entries: 524288 (order: 10, 4194304 bytes)
Inode-cache hash table entries: 262144 (order: 9, 2097152 bytes)
Sorting __ex_table...
Memory: 4119768K/4192256K available (5849K kernel code, 340K rwdata, 1541K rodata, 200K init, 847K bss, 72488K reserved, 0K cma-reserved)
SLUB: HWalign=64, Order=0-3, MinObjects=0, CPUs=2, Nodes=1
Hierarchical RCU implementation.
	RCU restricting CPUs from NR_CPUS=8 to nr_cpu_ids=2.
RCU: Adjusting geometry for rcu_fanout_leaf=16, nr_cpu_ids=2
NR_IRQS: 0, nr_irqs: 0, preallocated irqs: 0
riscv,cpu_intc,0: 64 local interrupts mapped
riscv,cpu_intc,1: 64 local interrupts mapped
------------[ cut here ]------------
WARNING: CPU: 0 PID: 0 at drivers/irqchip/irq-riscv-intc.c:159 riscv_irq_enable+0x92/0x94
CPU: 0 PID: 0 Comm: swapper/0 Not tainted 4.15.0-rc9-00064-gf923ce3a29af #1
Call Trace:
[<        (ptrval)>] walk_stackframe+0x0/0xa2
[<        (ptrval)>] show_stack+0x26/0x34
[<        (ptrval)>] dump_stack+0x5e/0x7c
[<        (ptrval)>] __warn+0xc6/0xdc
[<        (ptrval)>] warn_slowpath_null+0x2c/0x3e
[<        (ptrval)>] riscv_irq_enable+0x8e/0x94
[<        (ptrval)>] irq_enable+0x3a/0x6a
[<        (ptrval)>] __irq_startup+0x80/0x88
[<        (ptrval)>] irq_startup+0x4e/0xe2
[<        (ptrval)>] irq_activate_and_startup+0x1c/0x28
[<        (ptrval)>] __irq_do_set_handler+0x6e/0x134
[<        (ptrval)>] irq_set_chained_handler_and_data+0x2c/0x4a
[<        (ptrval)>] plic_init+0x216/0x34a
[<        (ptrval)>] of_irq_init+0x132/0x232
[<        (ptrval)>] irqchip_init+0x10/0x1c
[<        (ptrval)>] init_IRQ+0x8/0x14
[<        (ptrval)>] start_kernel+0x1f6/0x32c
[<        (ptrval)>] _sinittext+0x4e/0x56
random: get_random_bytes called from print_oops_end_marker+0x3a/0x52 with crng_init=0
---[ end trace 3f245499100bcdd5 ]---
riscv,plic0,c000000: mapped 10 interrupts to 2/4 handlers
clocksource: riscv_clocksource: mask: 0xffffffffffffffff max_cycles: 0x24e6a1710, max_idle_ns: 440795202120 ns
Console: colour dummy device 80x25
Calibrating delay loop (skipped), value calculated using timer frequency.. 20.00 BogoMIPS (lpj=40000)
pid_max: default: 32768 minimum: 301
Mount-cache hash table entries: 8192 (order: 4, 65536 bytes)
Mountpoint-cache hash table entries: 8192 (order: 4, 65536 bytes)
Hierarchical SRCU implementation.
smp: Bringing up secondary CPUs ...
clocksource: riscv_clocksource: mask: 0xffffffffffffffff max_cycles: 0x24e6a1710, max_idle_ns: 440795202120 ns
smp: Brought up 1 node, 2 CPUs
devtmpfs: initialized
clocksource: jiffies: mask: 0xffffffff max_cycles: 0xffffffff, max_idle_ns: 7645041785100000 ns
futex hash table entries: 512 (order: 3, 32768 bytes)
NET: Registered protocol family 16
vgaarb: loaded
SCSI subsystem initialized
usbcore: registered new interface driver usbfs
usbcore: registered new interface driver hub
usbcore: registered new device driver usb
clocksource: Switched to clocksource riscv_clocksource
NET: Registered protocol family 2
TCP established hash table entries: 32768 (order: 6, 262144 bytes)
TCP bind hash table entries: 32768 (order: 7, 524288 bytes)
TCP: Hash tables configured (established 32768 bind 32768)
UDP hash table entries: 2048 (order: 4, 65536 bytes)
UDP-Lite hash table entries: 2048 (order: 4, 65536 bytes)
NET: Registered protocol family 1
RPC: Registered named UNIX socket transport module.
RPC: Registered udp transport module.
RPC: Registered tcp transport module.
RPC: Registered tcp NFSv4.1 backchannel transport module.
Unpacking initramfs...
Initialise system trusted keyrings
workingset: timestamp_bits=62 max_order=20 bucket_order=0
NFS: Registering the id_resolver key type
Key type id_resolver registered
Key type id_legacy registered
nfs4filelayout_init: NFSv4 File Layout Driver Registering...
nfs4flexfilelayout_init: NFSv4 Flexfile Layout Driver Registering...
SGI XFS with ACLs, security attributes, no debug enabled
random: fast init done
NET: Registered protocol family 38
Key type asymmetric registered
Asymmetric key parser 'x509' registered
Block layer SCSI generic (bsg) driver version 0.4 loaded (major 254)
io scheduler noop registered
io scheduler deadline registered
io scheduler cfq registered (default)
io scheduler mq-deadline registered
io scheduler kyber registered
Serial: 8250/16550 driver, 4 ports, IRQ sharing disabled
console [ttyS0] disabled
10000000.uart: ttyS0 at MMIO 0x10000000 (irq = 11, base_baud = 230400) is a 16550A
console [ttyS0] enabled
console [ttyS0] enabled
[drm] radeon kernel modesetting enabled.
[drm] radeon kernel modesetting enabled.
loop: module loaded
loop: module loaded
libphy: Fixed MDIO Bus: probed
libphy: Fixed MDIO Bus: probed
e1000e: Intel(R) PRO/1000 Network Driver - 3.2.6-k
e1000e: Intel(R) PRO/1000 Network Driver - 3.2.6-k
e1000e: Copyright(c) 1999 - 2015 Intel Corporation.
e1000e: Copyright(c) 1999 - 2015 Intel Corporation.
ehci_hcd: USB 2.0 'Enhanced' Host Controller (EHCI) Driver
ehci_hcd: USB 2.0 'Enhanced' Host Controller (EHCI) Driver
ehci-pci: EHCI PCI platform driver
ehci-pci: EHCI PCI platform driver
ehci-platform: EHCI generic platform driver
ehci-platform: EHCI generic platform driver
ohci_hcd: USB 1.1 'Open' Host Controller (OHCI) Driver
ohci_hcd: USB 1.1 'Open' Host Controller (OHCI) Driver
ohci-pci: OHCI PCI platform driver
ohci-pci: OHCI PCI platform driver
ohci-platform: OHCI generic platform driver
ohci-platform: OHCI generic platform driver
usbcore: registered new interface driver uas
usbcore: registered new interface driver uas
usbcore: registered new interface driver usb-storage
usbcore: registered new interface driver usb-storage
mousedev: PS/2 mouse device common for all mice
mousedev: PS/2 mouse device common for all mice
usbcore: registered new interface driver usbhid
usbcore: registered new interface driver usbhid
usbhid: USB HID core driver
usbhid: USB HID core driver
NET: Registered protocol family 10
NET: Registered protocol family 10
Segment Routing with IPv6
Segment Routing with IPv6
sit: IPv6, IPv4 and MPLS over IPv4 tunneling driver
sit: IPv6, IPv4 and MPLS over IPv4 tunneling driver
NET: Registered protocol family 17
NET: Registered protocol family 17
Key type dns_resolver registered
Key type dns_resolver registered
bootconsole [early0] uses init memory and must be disabled even before the real one is ready
bootconsole [early0] uses init memory and must be disabled even before the real one is ready
bootconsole [early0] disabled
bootconsole [early0] disabled
Loading compiled-in X.509 certificates
EXT4-fs (vda): couldn't mount as ext3 due to feature incompatibilities
EXT4-fs (vda): couldn't mount as ext2 due to feature incompatibilities
EXT4-fs (vda): INFO: recovery required on readonly filesystem
EXT4-fs (vda): write access will be enabled during recovery
EXT4-fs (vda): recovery complete
EXT4-fs (vda): mounted filesystem with ordered data mode. Opts: (null)
VFS: Mounted root (ext4 filesystem) readonly on device 254:0.
Freeing unused kernel memory: 200K
This architecture does not have kernel memory protection.
EXT4-fs (vda): re-mounted. Opts: (null)
Wed Feb 21 18:48:00 UTC 2018
1: lo: <LOOPBACK> mtu 65536 qdisc noop state DOWN group default qlen 1000
    link/loopback 00:00:00:00:00:00 brd 00:00:00:00:00:00
2: eth0: <BROADCAST,MULTICAST,UP,LOWER_UP> mtu 1500 qdisc pfifo_fast state UP group default qlen 1000
    link/ether 52:54:00:12:34:56 brd ff:ff:ff:ff:ff:ff
    inet 10.0.2.15/24 scope global eth0
       valid_lft forever preferred_lft forever
    inet6 fe80::5054:ff:fe12:3456/64 scope link tentative 
       valid_lft forever preferred_lft forever
3: sit0@NONE: <NOARP> mtu 1480 qdisc noop state DOWN group default qlen 1000
    link/sit 0.0.0.0 brd 0.0.0.0
default via 10.0.2.2 dev eth0 
10.0.2.0/24 dev eth0 proto kernel scope link src 10.0.2.15 

Welcome to the Fedora/RISC-V stage4 builder

+ set -e
+ exec
+ rm -rf /rpmbuild
+ mkdir -p /rpmbuild
+ su -c 'rpmbuild -ba /builddir/build/SPECS/libwebsockets.spec            --define "debug_package %{nil}"            --undefine _annotated_build            --define "_missing_doc_files_terminate_build %{nil}"            --define "_emacs_sitestartdir /usr/share/emacs/site-lisp/site-start.d"            --define "_emacs_sitelispdir /usr/share/emacs/site-lisp"            --nocheck   ' mockbuild
Executing(%prep): /bin/sh -e /var/tmp/rpm-tmp.t7VEAI
+ umask 022
+ cd /builddir/build/BUILD
+ cd /builddir/build/BUILD
+ rm -rf libwebsockets-1.7.5
+ /usr/bin/gzip -dc /builddir/build/SOURCES/libwebsockets-1.7.5.tar.gz
+ /usr/bin/tar -xof -
+ STATUS=0
+ '[' 0 -ne 0 ']'
+ cd libwebsockets-1.7.5
+ /usr/bin/chmod -Rf a+rX,u+w,g-w,o-w .
+ exit 0
Executing(%build): /bin/sh -e /var/tmp/rpm-tmp.5srjQd
+ umask 022
+ cd /builddir/build/BUILD
+ cd libwebsockets-1.7.5
+ mkdir -p build
+ cd build
+ CFLAGS='-O2 -g -pipe -Wall -Werror=format-security -Wp,-D_FORTIFY_SOURCE=2 -Wp,-D_GLIBCXX_ASSERTIONS -fexceptions -fstack-protector-strong -grecord-gcc-switches -specs=/usr/lib/rpm/redhat/redhat-hardened-cc1 '
+ export CFLAGS
+ CXXFLAGS='-O2 -g -pipe -Wall -Werror=format-security -Wp,-D_FORTIFY_SOURCE=2 -Wp,-D_GLIBCXX_ASSERTIONS -fexceptions -fstack-protector-strong -grecord-gcc-switches -specs=/usr/lib/rpm/redhat/redhat-hardened-cc1 '
+ export CXXFLAGS
+ FFLAGS='-O2 -g -pipe -Wall -Werror=format-security -Wp,-D_FORTIFY_SOURCE=2 -Wp,-D_GLIBCXX_ASSERTIONS -fexceptions -fstack-protector-strong -grecord-gcc-switches -specs=/usr/lib/rpm/redhat/redhat-hardened-cc1  -I/usr/lib64/gfortran/modules'
+ export FFLAGS
+ FCFLAGS='-O2 -g -pipe -Wall -Werror=format-security -Wp,-D_FORTIFY_SOURCE=2 -Wp,-D_GLIBCXX_ASSERTIONS -fexceptions -fstack-protector-strong -grecord-gcc-switches -specs=/usr/lib/rpm/redhat/redhat-hardened-cc1  -I/usr/lib64/gfortran/modules'
+ export FCFLAGS
+ LDFLAGS='-Wl,-z,relro  -specs=/usr/lib/rpm/redhat/redhat-hardened-ld'
+ export LDFLAGS
+ /usr/bin/cmake -DCMAKE_C_FLAGS_RELEASE:STRING=-DNDEBUG -DCMAKE_CXX_FLAGS_RELEASE:STRING=-DNDEBUG -DCMAKE_Fortran_FLAGS_RELEASE:STRING=-DNDEBUG -DCMAKE_VERBOSE_MAKEFILE:BOOL=ON -DCMAKE_INSTALL_PREFIX:PATH=/usr -DINCLUDE_INSTALL_DIR:PATH=/usr/include -DLIB_INSTALL_DIR:PATH=/usr/lib64 -DSYSCONF_INSTALL_DIR:PATH=/etc -DSHARE_INSTALL_PREFIX:PATH=/usr/share -DLIB_SUFFIX=64 -DBUILD_SHARED_LIBS:BOOL=ON -D LWS_LINK_TESTAPPS_DYNAMIC=ON -D LWS_USE_LIBEV=OFF -D LWS_WITHOUT_BUILTIN_GETIFADDRS=ON -D LWS_USE_BUNDLED_ZLIB=OFF -D LWS_WITHOUT_BUILTIN_SHA1=ON -D LWS_WITH_STATIC=OFF ..
-- The C compiler identification is GNU 7.3.1
-- Check for working C compiler: /usr/bin/cc
-- Check for working C compiler: /usr/bin/cc -- works
-- Detecting C compiler ABI info
-- Detecting C compiler ABI info - done
-- Detecting C compile features
-- Detecting C compile features - done
-- CMAKE_TOOLCHAIN_FILE=''
-- Could NOT find Git (missing:  GIT_EXECUTABLE) 
-- Performing Test LWS_HAVE_inline
-- Performing Test LWS_HAVE_inline - Success
-- Performing Test LWS_HAVE___inline__
-- Performing Test LWS_HAVE___inline__ - Success
-- Performing Test LWS_HAVE___inline
-- Performing Test LWS_HAVE___inline - Success
-- Looking for bzero
-- Looking for bzero - found
-- Looking for fork
-- Looking for fork - found
-- Looking for getenv
-- Looking for getenv - found
-- Looking for malloc
-- Looking for malloc - found
-- Looking for memset
-- Looking for memset - found
-- Looking for realloc
-- Looking for realloc - found
-- Looking for socket
-- Looking for socket - found
-- Looking for strerror
-- Looking for strerror - found
-- Looking for vfork
-- Looking for vfork - found
-- Looking for getifaddrs
-- Looking for getifaddrs - found
-- Looking for snprintf
-- Looking for snprintf - found
-- Looking for _snprintf
-- Looking for _snprintf - not found
-- Looking for _vsnprintf
-- Looking for _vsnprintf - not found
-- Looking for dlfcn.h
-- Looking for dlfcn.h - found
-- Looking for fcntl.h
-- Looking for fcntl.h - found
-- Looking for in6addr.h
-- Looking for in6addr.h - not found
-- Looking for inttypes.h
-- Looking for inttypes.h - found
-- Looking for memory.h
-- Looking for memory.h - found
-- Looking for netinet/in.h
-- Looking for netinet/in.h - found
-- Looking for stdint.h
-- Looking for stdint.h - found
-- Looking for stdlib.h
-- Looking for stdlib.h - found
-- Looking for strings.h
-- Looking for strings.h - found
-- Looking for string.h
-- Looking for string.h - found
-- Looking for sys/prctl.h
-- Looking for sys/prctl.h - found
-- Looking for sys/socket.h
-- Looking for sys/socket.h - found
-- Looking for sys/stat.h
-- Looking for sys/stat.h - found
-- Looking for sys/types.h
-- Looking for sys/types.h - found
-- Looking for unistd.h
-- Looking for unistd.h - found
-- Looking for vfork.h
-- Looking for vfork.h - not found
-- Looking for zlib.h
-- Looking for zlib.h - found
-- Looking for 4 include files stdlib.h, ..., float.h
-- Looking for 4 include files stdlib.h, ..., float.h - found
-- Performing Test LWS_HAVE_VISIBILITY
-- Performing Test LWS_HAVE_VISIBILITY - Success
-- Found ZLIB: /usr/lib64/libz.so (found version "1.2.11") 
zlib include dirs: /usr/include
zlib libraries: /usr/lib64/libz.so
Compiling with SSL support
-- Found OpenSSL: /usr/lib64/libssl.so;/usr/lib64/libcrypto.so (found version "1.1.0g") 
OpenSSL include dir: /usr/include
OpenSSL libraries: /usr/lib64/libssl.so;/usr/lib64/libcrypto.so
-- Looking for openssl/ecdh.h
-- Looking for openssl/ecdh.h - found
Searching for OpenSSL executable and dlls
OpenSSL executable: OPENSSL_EXECUTABLE-NOTFOUND
Generating API documentation
-- Looking for RPMTools... - found rpmuild is /usr/bin/rpmbuild
-- RPMTools:: Using RPM_ROOTDIR=/builddir/build/BUILD/libwebsockets-1.7.5/build/RPM
-- Simple copy spec file <libwebsockets.spec> --> </builddir/build/BUILD/libwebsockets-1.7.5/build/RPM/SPECS/libwebsockets.spec>
---------------------------------------------------------------------
  Settings:  (For more help do cmake -LH <srcpath>)
---------------------------------------------------------------------
 LWS_WITH_STATIC = OFF
 LWS_WITH_SHARED = ON
 LWS_WITH_SSL = ON (SSL Support)
 LWS_SSL_CLIENT_USE_OS_CA_CERTS = 1
 LWS_USE_WOLFSSL = OFF (wolfSSL/CyaSSL replacement for OpenSSL)
 LWS_WITHOUT_BUILTIN_SHA1 = ON
 LWS_WITHOUT_BUILTIN_GETIFADDRS = ON
 LWS_WITHOUT_CLIENT = OFF
 LWS_WITHOUT_SERVER = OFF
 LWS_LINK_TESTAPPS_DYNAMIC = ON
 LWS_WITHOUT_TESTAPPS = OFF
 LWS_WITHOUT_TEST_SERVER = OFF
 LWS_WITHOUT_TEST_SERVER_EXTPOLL = OFF
 LWS_WITHOUT_TEST_PING = OFF
 LWS_WITHOUT_TEST_ECHO = OFF
 LWS_WITHOUT_TEST_CLIENT = OFF
 LWS_WITHOUT_TEST_FRAGGLE = OFF
 LWS_WITHOUT_EXTENSIONS = OFF
 LWS_WITH_LATENCY = OFF
 LWS_WITHOUT_DAEMONIZE = ON
 LWS_USE_LIBEV = OFF
 LWS_USE_LIBUV = 
 LWS_IPV6 = OFF
 LWS_WITH_HTTP2 = OFF
 LWS_MBED3 = OFF
 LWS_SSL_SERVER_WITH_ECDH_CERT = OFF
 LWS_MAX_SMP = 32
 LWS_HAVE_OPENSSL_ECDH_H = 1
---------------------------------------------------------------------
-- Configuring done
-- Generating done
CMake Warning:
  Manually-specified variables were not used by the project:

    CMAKE_CXX_FLAGS_RELEASE
    CMAKE_Fortran_FLAGS_RELEASE
    INCLUDE_INSTALL_DIR
    LIB_INSTALL_DIR
    SHARE_INSTALL_PREFIX
    SYSCONF_INSTALL_DIR


-- Build files have been written to: /builddir/build/BUILD/libwebsockets-1.7.5/build
+ make -j2
/usr/bin/cmake -H/builddir/build/BUILD/libwebsockets-1.7.5 -B/builddir/build/BUILD/libwebsockets-1.7.5/build --check-build-system CMakeFiles/Makefile.cmake 0
/usr/bin/cmake -E cmake_progress_start /builddir/build/BUILD/libwebsockets-1.7.5/build/CMakeFiles /builddir/build/BUILD/libwebsockets-1.7.5/build/CMakeFiles/progress.marks
make -f CMakeFiles/Makefile2 all
make[1]: Entering directory '/builddir/build/BUILD/libwebsockets-1.7.5/build'
make -f CMakeFiles/websockets_shared.dir/build.make CMakeFiles/websockets_shared.dir/depend
make[2]: Entering directory '/builddir/build/BUILD/libwebsockets-1.7.5/build'
cd /builddir/build/BUILD/libwebsockets-1.7.5/build && /usr/bin/cmake -E cmake_depends "Unix Makefiles" /builddir/build/BUILD/libwebsockets-1.7.5 /builddir/build/BUILD/libwebsockets-1.7.5 /builddir/build/BUILD/libwebsockets-1.7.5/build /builddir/build/BUILD/libwebsockets-1.7.5/build /builddir/build/BUILD/libwebsockets-1.7.5/build/CMakeFiles/websockets_shared.dir/DependInfo.cmake --color=
Scanning dependencies of target websockets_shared
make[2]: Leaving directory '/builddir/build/BUILD/libwebsockets-1.7.5/build'
make -f CMakeFiles/websockets_shared.dir/build.make CMakeFiles/websockets_shared.dir/build
make[2]: Entering directory '/builddir/build/BUILD/libwebsockets-1.7.5/build'
[  1%] Building C object CMakeFiles/websockets_shared.dir/lib/base64-decode.c.o
/usr/bin/cc  -Dwebsockets_shared_EXPORTS -I/builddir/build/BUILD/libwebsockets-1.7.5/build -I/builddir/build/BUILD/libwebsockets-1.7.5/lib  -Wall -Werror -fvisibility=hidden -O2 -g -pipe -Wall -Werror=format-security -Wp,-D_FORTIFY_SOURCE=2 -Wp,-D_GLIBCXX_ASSERTIONS -fexceptions -fstack-protector-strong -grecord-gcc-switches -specs=/usr/lib/rpm/redhat/redhat-hardened-cc1   -pthread -DNDEBUG -fPIC   -o CMakeFiles/websockets_shared.dir/lib/base64-decode.c.o   -c /builddir/build/BUILD/libwebsockets-1.7.5/lib/base64-decode.c
[  3%] Building C object CMakeFiles/websockets_shared.dir/lib/handshake.c.o
/usr/bin/cc  -Dwebsockets_shared_EXPORTS -I/builddir/build/BUILD/libwebsockets-1.7.5/build -I/builddir/build/BUILD/libwebsockets-1.7.5/lib  -Wall -Werror -fvisibility=hidden -O2 -g -pipe -Wall -Werror=format-security -Wp,-D_FORTIFY_SOURCE=2 -Wp,-D_GLIBCXX_ASSERTIONS -fexceptions -fstack-protector-strong -grecord-gcc-switches -specs=/usr/lib/rpm/redhat/redhat-hardened-cc1   -pthread -DNDEBUG -fPIC   -o CMakeFiles/websockets_shared.dir/lib/handshake.c.o   -c /builddir/build/BUILD/libwebsockets-1.7.5/lib/handshake.c
[  5%] Building C object CMakeFiles/websockets_shared.dir/lib/libwebsockets.c.o
/usr/bin/cc  -Dwebsockets_shared_EXPORTS -I/builddir/build/BUILD/libwebsockets-1.7.5/build -I/builddir/build/BUILD/libwebsockets-1.7.5/lib  -Wall -Werror -fvisibility=hidden -O2 -g -pipe -Wall -Werror=format-security -Wp,-D_FORTIFY_SOURCE=2 -Wp,-D_GLIBCXX_ASSERTIONS -fexceptions -fstack-protector-strong -grecord-gcc-switches -specs=/usr/lib/rpm/redhat/redhat-hardened-cc1   -pthread -DNDEBUG -fPIC   -o CMakeFiles/websockets_shared.dir/lib/libwebsockets.c.o   -c /builddir/build/BUILD/libwebsockets-1.7.5/lib/libwebsockets.c
[  7%] Building C object CMakeFiles/websockets_shared.dir/lib/service.c.o
/usr/bin/cc  -Dwebsockets_shared_EXPORTS -I/builddir/build/BUILD/libwebsockets-1.7.5/build -I/builddir/build/BUILD/libwebsockets-1.7.5/lib  -Wall -Werror -fvisibility=hidden -O2 -g -pipe -Wall -Werror=format-security -Wp,-D_FORTIFY_SOURCE=2 -Wp,-D_GLIBCXX_ASSERTIONS -fexceptions -fstack-protector-strong -grecord-gcc-switches -specs=/usr/lib/rpm/redhat/redhat-hardened-cc1   -pthread -DNDEBUG -fPIC   -o CMakeFiles/websockets_shared.dir/lib/service.c.o   -c /builddir/build/BUILD/libwebsockets-1.7.5/lib/service.c
[  9%] Building C object CMakeFiles/websockets_shared.dir/lib/pollfd.c.o
/usr/bin/cc  -Dwebsockets_shared_EXPORTS -I/builddir/build/BUILD/libwebsockets-1.7.5/build -I/builddir/build/BUILD/libwebsockets-1.7.5/lib  -Wall -Werror -fvisibility=hidden -O2 -g -pipe -Wall -Werror=format-security -Wp,-D_FORTIFY_SOURCE=2 -Wp,-D_GLIBCXX_ASSERTIONS -fexceptions -fstack-protector-strong -grecord-gcc-switches -specs=/usr/lib/rpm/redhat/redhat-hardened-cc1   -pthread -DNDEBUG -fPIC   -o CMakeFiles/websockets_shared.dir/lib/pollfd.c.o   -c /builddir/build/BUILD/libwebsockets-1.7.5/lib/pollfd.c
[ 11%] Building C object CMakeFiles/websockets_shared.dir/lib/output.c.o
/usr/bin/cc  -Dwebsockets_shared_EXPORTS -I/builddir/build/BUILD/libwebsockets-1.7.5/build -I/builddir/build/BUILD/libwebsockets-1.7.5/lib  -Wall -Werror -fvisibility=hidden -O2 -g -pipe -Wall -Werror=format-security -Wp,-D_FORTIFY_SOURCE=2 -Wp,-D_GLIBCXX_ASSERTIONS -fexceptions -fstack-protector-strong -grecord-gcc-switches -specs=/usr/lib/rpm/redhat/redhat-hardened-cc1   -pthread -DNDEBUG -fPIC   -o CMakeFiles/websockets_shared.dir/lib/output.c.o   -c /builddir/build/BUILD/libwebsockets-1.7.5/lib/output.c
[ 13%] Building C object CMakeFiles/websockets_shared.dir/lib/parsers.c.o
/usr/bin/cc  -Dwebsockets_shared_EXPORTS -I/builddir/build/BUILD/libwebsockets-1.7.5/build -I/builddir/build/BUILD/libwebsockets-1.7.5/lib  -Wall -Werror -fvisibility=hidden -O2 -g -pipe -Wall -Werror=format-security -Wp,-D_FORTIFY_SOURCE=2 -Wp,-D_GLIBCXX_ASSERTIONS -fexceptions -fstack-protector-strong -grecord-gcc-switches -specs=/usr/lib/rpm/redhat/redhat-hardened-cc1   -pthread -DNDEBUG -fPIC   -o CMakeFiles/websockets_shared.dir/lib/parsers.c.o   -c /builddir/build/BUILD/libwebsockets-1.7.5/lib/parsers.c
[ 15%] Building C object CMakeFiles/websockets_shared.dir/lib/context.c.o
/usr/bin/cc  -Dwebsockets_shared_EXPORTS -I/builddir/build/BUILD/libwebsockets-1.7.5/build -I/builddir/build/BUILD/libwebsockets-1.7.5/lib  -Wall -Werror -fvisibility=hidden -O2 -g -pipe -Wall -Werror=format-security -Wp,-D_FORTIFY_SOURCE=2 -Wp,-D_GLIBCXX_ASSERTIONS -fexceptions -fstack-protector-strong -grecord-gcc-switches -specs=/usr/lib/rpm/redhat/redhat-hardened-cc1   -pthread -DNDEBUG -fPIC   -o CMakeFiles/websockets_shared.dir/lib/context.c.o   -c /builddir/build/BUILD/libwebsockets-1.7.5/lib/context.c
[ 17%] Building C object CMakeFiles/websockets_shared.dir/lib/alloc.c.o
/usr/bin/cc  -Dwebsockets_shared_EXPORTS -I/builddir/build/BUILD/libwebsockets-1.7.5/build -I/builddir/build/BUILD/libwebsockets-1.7.5/lib  -Wall -Werror -fvisibility=hidden -O2 -g -pipe -Wall -Werror=format-security -Wp,-D_FORTIFY_SOURCE=2 -Wp,-D_GLIBCXX_ASSERTIONS -fexceptions -fstack-protector-strong -grecord-gcc-switches -specs=/usr/lib/rpm/redhat/redhat-hardened-cc1   -pthread -DNDEBUG -fPIC   -o CMakeFiles/websockets_shared.dir/lib/alloc.c.o   -c /builddir/build/BUILD/libwebsockets-1.7.5/lib/alloc.c
[ 19%] Building C object CMakeFiles/websockets_shared.dir/lib/header.c.o
/usr/bin/cc  -Dwebsockets_shared_EXPORTS -I/builddir/build/BUILD/libwebsockets-1.7.5/build -I/builddir/build/BUILD/libwebsockets-1.7.5/lib  -Wall -Werror -fvisibility=hidden -O2 -g -pipe -Wall -Werror=format-security -Wp,-D_FORTIFY_SOURCE=2 -Wp,-D_GLIBCXX_ASSERTIONS -fexceptions -fstack-protector-strong -grecord-gcc-switches -specs=/usr/lib/rpm/redhat/redhat-hardened-cc1   -pthread -DNDEBUG -fPIC   -o CMakeFiles/websockets_shared.dir/lib/header.c.o   -c /builddir/build/BUILD/libwebsockets-1.7.5/lib/header.c
[ 21%] Building C object CMakeFiles/websockets_shared.dir/lib/client.c.o
/usr/bin/cc  -Dwebsockets_shared_EXPORTS -I/builddir/build/BUILD/libwebsockets-1.7.5/build -I/builddir/build/BUILD/libwebsockets-1.7.5/lib  -Wall -Werror -fvisibility=hidden -O2 -g -pipe -Wall -Werror=format-security -Wp,-D_FORTIFY_SOURCE=2 -Wp,-D_GLIBCXX_ASSERTIONS -fexceptions -fstack-protector-strong -grecord-gcc-switches -specs=/usr/lib/rpm/redhat/redhat-hardened-cc1   -pthread -DNDEBUG -fPIC   -o CMakeFiles/websockets_shared.dir/lib/client.c.o   -c /builddir/build/BUILD/libwebsockets-1.7.5/lib/client.c
[ 23%] Building C object CMakeFiles/websockets_shared.dir/lib/client-handshake.c.orandom: crng init done

/usr/bin/cc  -Dwebsockets_shared_EXPORTS -I/builddir/build/BUILD/libwebsockets-1.7.5/build -I/builddir/build/BUILD/libwebsockets-1.7.5/lib  -Wall -Werror -fvisibility=hidden -O2 -g -pipe -Wall -Werror=format-security -Wp,-D_FORTIFY_SOURCE=2 -Wp,-D_GLIBCXX_ASSERTIONS -fexceptions -fstack-protector-strong -grecord-gcc-switches -specs=/usr/lib/rpm/redhat/redhat-hardened-cc1   -pthread -DNDEBUG -fPIC   -o CMakeFiles/websockets_shared.dir/lib/client-handshake.c.o   -c /builddir/build/BUILD/libwebsockets-1.7.5/lib/client-handshake.c
[ 25%] Building C object CMakeFiles/websockets_shared.dir/lib/client-parser.c.o
/usr/bin/cc  -Dwebsockets_shared_EXPORTS -I/builddir/build/BUILD/libwebsockets-1.7.5/build -I/builddir/build/BUILD/libwebsockets-1.7.5/lib  -Wall -Werror -fvisibility=hidden -O2 -g -pipe -Wall -Werror=format-security -Wp,-D_FORTIFY_SOURCE=2 -Wp,-D_GLIBCXX_ASSERTIONS -fexceptions -fstack-protector-strong -grecord-gcc-switches -specs=/usr/lib/rpm/redhat/redhat-hardened-cc1   -pthread -DNDEBUG -fPIC   -o CMakeFiles/websockets_shared.dir/lib/client-parser.c.o   -c /builddir/build/BUILD/libwebsockets-1.7.5/lib/client-parser.c
[ 27%] Building C object CMakeFiles/websockets_shared.dir/lib/ssl.c.o
/usr/bin/cc  -Dwebsockets_shared_EXPORTS -I/builddir/build/BUILD/libwebsockets-1.7.5/build -I/builddir/build/BUILD/libwebsockets-1.7.5/lib  -Wall -Werror -fvisibility=hidden -O2 -g -pipe -Wall -Werror=format-security -Wp,-D_FORTIFY_SOURCE=2 -Wp,-D_GLIBCXX_ASSERTIONS -fexceptions -fstack-protector-strong -grecord-gcc-switches -specs=/usr/lib/rpm/redhat/redhat-hardened-cc1   -pthread -DNDEBUG -fPIC   -o CMakeFiles/websockets_shared.dir/lib/ssl.c.o   -c /builddir/build/BUILD/libwebsockets-1.7.5/lib/ssl.c
/builddir/build/BUILD/libwebsockets-1.7.5/lib/ssl.c: In function 'lws_ssl_destroy':
/builddir/build/BUILD/libwebsockets-1.7.5/lib/ssl.c:365:2: error: 'ERR_remove_thread_state' is deprecated [-Werror=deprecated-declarations]
  ERR_remove_thread_state(NULL);
  ^~~~~~~~~~~~~~~~~~~~~~~
In file included from /usr/include/openssl/ct.h:13:0,
                 from /usr/include/openssl/ssl.h:61,
                 from /builddir/build/BUILD/libwebsockets-1.7.5/lib/private-libwebsockets.h:187,
                 from /builddir/build/BUILD/libwebsockets-1.7.5/lib/ssl.c:22:
/usr/include/openssl/err.h:247:1: note: declared here
 DEPRECATEDIN_1_1_0(void ERR_remove_thread_state(void *))
 ^
/builddir/build/BUILD/libwebsockets-1.7.5/lib/ssl.c: In function 'lws_ssl_context_destroy':
/builddir/build/BUILD/libwebsockets-1.7.5/lib/ssl.c:838:2: error: 'ERR_remove_thread_state' is deprecated [-Werror=deprecated-declarations]
  ERR_remove_thread_state(NULL);
  ^~~~~~~~~~~~~~~~~~~~~~~
In file included from /usr/include/openssl/ct.h:13:0,
                 from /usr/include/openssl/ssl.h:61,
                 from /builddir/build/BUILD/libwebsockets-1.7.5/lib/private-libwebsockets.h:187,
                 from /builddir/build/BUILD/libwebsockets-1.7.5/lib/ssl.c:22:
/usr/include/openssl/err.h:247:1: note: declared here
 DEPRECATEDIN_1_1_0(void ERR_remove_thread_state(void *))
 ^
[ 29%] Building C object CMakeFiles/websockets_shared.dir/lib/lws-plat-unix.c.o
/usr/bin/cc  -Dwebsockets_shared_EXPORTS -I/builddir/build/BUILD/libwebsockets-1.7.5/build -I/builddir/build/BUILD/libwebsockets-1.7.5/lib  -Wall -Werror -fvisibility=hidden -O2 -g -pipe -Wall -Werror=format-security -Wp,-D_FORTIFY_SOURCE=2 -Wp,-D_GLIBCXX_ASSERTIONS -fexceptions -fstack-protector-strong -grecord-gcc-switches -specs=/usr/lib/rpm/redhat/redhat-hardened-cc1   -pthread -DNDEBUG -fPIC   -o CMakeFiles/websockets_shared.dir/lib/lws-plat-unix.c.o   -c /builddir/build/BUILD/libwebsockets-1.7.5/lib/lws-plat-unix.c
cc1: all warnings being treated as errors
make[2]: *** [CMakeFiles/websockets_shared.dir/build.make:378: CMakeFiles/websockets_shared.dir/lib/ssl.c.o] Error 1
make[2]: *** Waiting for unfinished jobs....
make[2]: Leaving directory '/builddir/build/BUILD/libwebsockets-1.7.5/build'
make[1]: *** [CMakeFiles/Makefile2:256: CMakeFiles/websockets_shared.dir/all] Error 2
make[1]: Leaving directory '/builddir/build/BUILD/libwebsockets-1.7.5/build'
make: *** [Makefile:153: all] Error 2
error: Bad exit status from /var/tmp/rpm-tmp.5srjQd (%build)


RPM build errors:
    Bad exit status from /var/tmp/rpm-tmp.5srjQd (%build)
++ cleanup
++ set +e
++ sync
++ sleep 5
++ sync
++ mount.static -o remount,ro /
++ poweroff
reboot: Power down
Power off